{"text_format":"1","workbook":"xlsx","n_sheets":7,"sheets":["Anleitung","MASTER","Gruppeneinteilung","Spielplan Versand","Resultate VR","Schlussrangliste","Spielberichte"],"not_rendered":{"charts":0,"images":3,"macros":1,"external_links":0,"defined_names":6,"comments":0,"pivot_tables":0},"unopened":[],"bounds":{"document_bytes":16777216,"sheet_cells":100000,"rows_first":2000,"rows_last":500,"rows_between":2000,"halvings":0,"cell_chars":16384,"cell_head_chars":4096},"cells_cut":0,"cells_raw":0,"read":"whole","date_system":"1900"}

{"sheet":"Anleitung","index":0,"n_rows":0,"n_cols":0,"rows_kept":0,"cut":false,"hidden":false,"merged":[]}

{"sheet":"MASTER","index":1,"n_rows":10,"n_cols":4,"rows_kept":10,"cut":false,"hidden":false,"merged":[]}
["Wettbewerb","Ostschweizer Meisterschaft"]
[]
["Datum Ort","So. 15.12.2019","Aadorf, Löhracker"]
[null,null,"Anspielzeit","Rhythmus"]
["Wettbewerb 1","Vorrunde","13:30:00","00:30:00"]
[null,"Finalrunde","15:00:00","00:40:00"]
[]
["Saison","Halle 2019/2020"]
[]
["Kategorie","U14"]

{"sheet":"Gruppeneinteilung","index":2,"n_rows":20,"n_cols":2,"rows_kept":20,"cut":false,"hidden":false,"merged":[]}
[{"$f":"CONCATENATE(MASTER!B1, \" \", MASTER!B8, \" - Kat. \", MASTER!B10)","v":"Ostschweizer Meisterschaft Halle 2019/2020 - Kat. U14"}]
[{"$f":"CONCATENATE(MASTER!B3,\" / \",MASTER!C3)","v":"So. 15.12.2019 / Aadorf, Löhracker"}]
[{"$f":"MASTER!B6","v":"Finalrunde"}]
[]
["Gruppe A","Mannschaften"]
["A1","STV Affeltrangen"]
["A2","FG RiWi 2"]
["A3","SVD Diepoldsau"]
[]
["Gruppe B"]
["B1","TS Höchst"]
["B2","FBV Ettenhausen "]
["B3","FBT Flums"]
[]
["Gruppe C"]
["C1","FG RiWi 1"]
["C2","TS Schwarzach"]
["C3","STV Wigoltingen"]
["C4","Satus Kreuzlingen"]
["C5","JFB Widnau"]
{"$rows_left_out":1}
{"sheet":"Spielplan Versand","index":3,"n_rows":42,"n_cols":18,"rows_kept":42,"cut":false,"hidden":false,"merged":[[14,2,14,4],[14,8,14,10],[21,8,21,10],[21,14,21,16],[22,8,22,10],[22,14,22,16],[23,2,23,4],[23,8,23,10],[23,14,23,16],[21,2,21,4],[22,2,22,4],[31,14,31,16],[24,2,24,4],[24,8,24,10],[24,14,24,16],[25,8,25,10],[25,14,25,16]]}
[{"$f":"CONCATENATE(MASTER!B1, \" \", MASTER!B8, \" - Kat. \", MASTER!B10)","v":"Ostschweizer Meisterschaft Halle 2019/2020 - Kat. U14"}]
[{"$f":"CONCATENATE(MASTER!B3,\" / \",MASTER!C3)","v":"So. 15.12.2019 / Aadorf, Löhracker"}]
[{"$f":"MASTER!B6","v":"Finalrunde"}]
[]
[]
[null,"Gruppe A (Ränge 1-6)",null,null,null,null,null,"Gruppe B (Ränge 1-6)"]
[null,"A1",{"$f":"VLOOKUP(B7, Gruppeneinteilung!$A$6:$B$1000, 2,FALSE)","v":"STV Affeltrangen"},null,null,null,null,"B1",{"$f":"VLOOKUP(H7, Gruppeneinteilung!$A$6:$B$1000, 2,FALSE)","v":"TS Höchst"}]
[null,"A2",{"$f":"VLOOKUP(B8, Gruppeneinteilung!$A$6:$B$1000, 2,FALSE)","v":"FG RiWi 2"},null,null,null,null,"B2",{"$f":"VLOOKUP(H8, Gruppeneinteilung!$A$6:$B$1000, 2,FALSE)","v":"FBV Ettenhausen "}]
[null,"A3",{"$f":"VLOOKUP(B9, Gruppeneinteilung!$A$6:$B$1000, 2,FALSE)","v":"SVD Diepoldsau"},null,null,null,null,"B3",{"$f":"VLOOKUP(H9, Gruppeneinteilung!$A$6:$B$1000, 2,FALSE)","v":"FBT Flums"}]
[]
[]
[]
["Vorrunde (2 Gewinnsätze à 11 Punkte; max. 15:14)"]
[]
["Zeit","Spiel","Feld 1",null,null,"SR",null,"Spiel","Feld 2",null,null,"SR"]
[{"$f":"MASTER!C5","v":"13:30:00"},1,{"$f":"$B$7","v":"A1"},"-",{"$f":"$B$8","v":"A2"},{"$f":"B9","v":"A3"},null,{"$f":"+B16+1","v":2},{"$f":"$H$7","v":"B1"},"-",{"$f":"$H$8","v":"B2"},{"$f":"$H$9","v":"B3"}]
["anschl.",{"$f":"+B16+2","v":3},{"$f":"$B$8","v":"A2"},"-",{"$f":"$B$9","v":"A3"},{"$f":"$B$7","v":"A1"},null,{"$f":"+H16+2","v":4},{"$f":"$H$8","v":"B2"},"-",{"$f":"$H$9","v":"B3"},{"$f":"H7","v":"B1"}]
[null,{"$f":"+B17+2","v":5},{"$f":"$B$7","v":"A1"},"-",{"$f":"$B$9","v":"A3"},{"$f":"B8","v":"A2"},null,{"$f":"+H17+2","v":6},{"$f":"$H$7","v":"B1"},"-",{"$f":"$H$9","v":"B3"},{"$f":"$H$8","v":"B2"}]
[]
[{"$f":"CONCATENATE(MASTER!B6,\" (2 Gewinnsätze à 11 Punkte; max. 15:14)\")","v":"Finalrunde (2 Gewinnsätze à 11 Punkte; max. 15:14)"}]
{"$rows_left_out":23}
{"sheet":"Resultate VR","index":4,"n_rows":76,"n_cols":70,"rows_kept":76,"cut":false,"hidden":false,"merged":[[62,30,66,30],[62,31,66,31],[52,30,56,30],[52,31,56,31],[38,6,38,8],[57,30,61,30],[57,31,61,31],[47,30,51,30],[47,31,51,31],[9,6,9,8],[16,34,16,35],[11,26,12,26],[42,26,43,26],[20,6,20,8],[22,26,23,26],[35,34,35,35],[42,30,46,30],[42,31,46,31]]}
[{"$f":"CONCATENATE(MASTER!B1, \" \", MASTER!B8, \" - Kat. \", MASTER!B10)","v":"Ostschweizer Meisterschaft Halle 2019/2020 - Kat. U14"},null,null,null,null,null,null,null,null,null,null,null,null,null,null,null,null,null,null,null,null,null,null,null,null,null,null,null,null,{"$f":"TODAY()","v":"2019-12-15"}]
[{"$f":"CONCATENATE(MASTER!B3,\" / \",MASTER!C3)","v":"So. 15.12.2019 / Aadorf, Löhracker"}]
[{"$f":"MASTER!B6","v":"Finalrunde"}]
[null,null,null,null,null,null,null,null,null,null,null,null,null,null,null,null,null,null,null,null,null,null,null,null,null,null,null,null,null,null,null,null,null,"Sp","Pkte","S+","S-","S+/-","B+","B-","B+/-"]
["Resultate Gruppe A",null,null,null,null,null,null,null,null,null,null,null,null,null,null,null,null,null,null,null,null,null,null,null,null,null,null,null,null,null,"A1",{"$f":"VLOOKUP(AE5,Gruppeneinteilung!$A$5:$B$20,2,0)","v":"STV Affeltrangen"},1,{"$f":"IF(OR(AQ5>0,AR5>0),1,0)","v":1},{"$f":"((AQ5>AR5)*1+(AS5>AT5)*1+(AU5>AV5)*1+(AW5>AX5)*1+(AY5>AZ5)*1>1.99)*2+((BB5>BC5)*1+(BD5>BE5)*1+(BF5>BG5)*1+(BH5>BI5)*1+(BJ5>BK5)*1>1.99)*2","v":0},{"$f":"IF(AQ5>AR5,1,0)+IF(AS5>AT5,1,0)+IF(AU5>AV5,1,0)+IF(AW5>AX5,1,0)+IF(AY5>AZ5,1,0)+IF(BB5>BC5,1,0)+IF(BD5>BE5,1,0)+IF(BF5>BG5,1,0)+IF(BH5>BI5,1,0)+IF(BJ5>BK5,1,0)","v":0},{"$f":"IF(AQ5<AR5,1,0)+IF(AS5<AT5,1,0)+IF(AU5<AV5,1,0)+IF(AW5<AX5,1,0)+IF(AY5<AZ5,1,0)+IF(BB5<BC5,1,0)+IF(BD5<BE5,1,0)+IF(BF5<BG5,1,0)+IF(BH5<BI5,1,0)+IF(BJ5<BK5,1,0)","v":2},{"$f":"AJ5-AK5","v":-2},{"$f":"AQ5+AS5+AU5+BB5+BD5+BF5","v":15},24,{"$f":"AM5-AN5","v":-9},null,{"$f":"O6","v":4},{"$f":"Q6","v":11},{"$f":"S6","v":11},{"$f":"U6","v":13},{"$f":"W6","v":0},{"$f":"Y6","v":0}]
[null,{"$f":"VLOOKUP(AB6,Gruppeneinteilung!$A$5:$B$20,2,0)","v":"STV Affeltrangen"},null,"-",{"$f":"VLOOKUP(AC6,Gruppeneinteilung!$A$5:$B$20,2,0)","v":"FG RiWi 2"},null,null,null,null,0,":",2,null,"(",4,":",11,",",11,":",13,",",null,":",null,")",null,"A1","A2",null,null,null,2,{"$f":"IF(OR(AQ6>0,AR6>0),1,0)","v":1},{"$f":"((AQ6>AR6)*1+(AS6>AT6)*1+(AU6>AV6)*1+(AW6>AX6)*1+(AY6>AZ6)*1>1.99)*2+((BB6>BC6)*1+(BD6>BE6)*1+(BF6>BG6)*1+(BH6>BI6)*1+(BJ6>BK6)*1>1.99)*2","v":2},{"$f":"IF(AQ6>AR6,1,0)+IF(AS6>AT6,1,0)+IF(AU6>AV6,1,0)+IF(AW6>AX6,1,0)+IF(AY6>AZ6,1,0)+IF(BB6>BC6,1,0)+IF(BD6>BE6,1,0)+IF(BF6>BG6,1,0)+IF(BH6>BI6,1,0)+IF(BJ6>BK6,1,0)","v":2},{"$f":"IF(AQ6<AR6,1,0)+IF(AS6<AT6,1,0)+IF(AU6<AV6,1,0)+IF(AW6<AX6,1,0)+IF(AY6<AZ6,1,0)+IF(BB6<BC6,1,0)+IF(BD6<BE6,1,0)+IF(BF6<BG6,1,0)+IF(BH6<BI6,1,0)+IF(BJ6<BK6,1,0)","v":1},{"$f":"AJ6-AK6","v":1},35,34,{"$f":"AM6-AN6","v":1},null,{"$f":"O8","v":9},{"$f":"Q8","v":11},{"$f":"S8","v":15},{"$f":"U8","v":14},{"$f":"W8","v":11},{"$f":"Y8","v":9},null,null,null,null,null,null,null,null,null,null,null,null,null,null,null,null,"Direkte Begegnung Gruppe A"]
[null,{"$f":"VLOOKUP(AB7,Gruppeneinteilung!$A$5:$B$20,2,0)","v":"FG RiWi 2"},null,"-",{"$f":"VLOOKUP(AC7,Gruppeneinteilung!$A$5:$B$20,2,0)","v":"SVD Diepoldsau"},null,null,null,null,2,":",0,null,"(",12,":",10,",",11,":",9,",",null,":",null,")",null,"A2","A3",null,null,null,null,{"$f":"SUM(AH5:AH6)","v":2},2,2,3,-1,50,58,-8]
[null,{"$f":"VLOOKUP(AB8,Gruppeneinteilung!$A$5:$B$20,2,0)","v":"STV Affeltrangen"},null,"-",{"$f":"VLOOKUP(AC8,Gruppeneinteilung!$A$5:$B$20,2,0)","v":"SVD Diepoldsau"},null,null,null,null,2,":",1,null,"(",9,":",11,",",15,":",14,",",11,":",9,")",null,"A1","A3",null,"A2",{"$f":"VLOOKUP(AE8,Gruppeneinteilung!$A$5:$B$20,2,0)","v":"FG RiWi 2"},1,{"$f":"IF(OR(AQ8>0,AR8>0),1,0)","v":1},{"$f":"((AQ8>AR8)*1+(AS8>AT8)*1+(AU8>AV8)*1+(AW8>AX8)*1+(AY8>AZ8)*1>1.99)*2+((BB8>BC8)*1+(BD8>BE8)*1+(BF8>BG8)*1+(BH8>BI8)*1+(BJ8>BK8)*1>1.99)*2","v":2},{"$f":"IF(AQ8>AR8,1,0)+IF(AS8>AT8,1,0)+IF(AU8>AV8,1,0)+IF(AW8>AX8,1,0)+IF(AY8>AZ8,1,0)+IF(BB8>BC8,1,0)+IF(BD8>BE8,1,0)+IF(BF8>BG8,1,0)+IF(BH8>BI8,1,0)+IF(BJ8>BK8,1,0)","v":2},{"$f":"IF(AQ8<AR8,1,0)+IF(AS8<AT8,1,0)+IF(AU8<AV8,1,0)+IF(AW8<AX8,1,0)+IF(AY8<AZ8,1,0)+IF(BB8<BC8,1,0)+IF(BD8<BE8,1,0)+IF(BF8<BG8,1,0)+IF(BH8<BI8,1,0)+IF(BJ8<BK8,1,0)","v":0},{"$f":"AJ8-AK8","v":2},{"$f":"AQ8+AS8+AU8+BB8+BD8+BF8","v":24},{"$f":"AR8+AT8+AV8+BC8+BE8+BG8","v":15},{"$f":"AM8-AN8","v":9},null,{"$f":"Q6","v":11},{"$f":"O6","v":4},{"$f":"U6","v":13},{"$f":"S6","v":11},{"$f":"Y6","v":0},{"$f":"W6","v":0},null,null,null,null,null,null,null,null,null,null,null,null,null,null,null,null,{"$f":"$F$11-$F$12","v":2},{"$f":"$F$12-$F$13","v":2},null,null,null,{"$f":"MIN(BM8:BQ8)","v":2}]
[null,null,null,null,null,null,null,null,null,null,null,null,null,null,null,null,null,null,null,null,null,null,null,null,null,null,null,null,null,null,null,null,3,{"$f":"IF(OR(AQ9>0,AR9>0),1,0)","v":1},{"$f":"((AQ9>AR9)*1+(AS9>AT9)*1+(AU9>AV9)*1+(AW9>AX9)*1+(AY9>AZ9)*1>1.99)*2+((BB9>BC9)*1+(BD9>BE9)*1+(BF9>BG9)*1+(BH9>BI9)*1+(BJ9>BK9)*1>1.99)*2","v":2},{"$f":"IF(AQ9>AR9,1,0)+IF(AS9>AT9,1,0)+IF(AU9>AV9,1,0)+IF(AW9>AX9,1,0)+IF(AY9>AZ9,1,0)+IF(BB9>BC9,1,0)+IF(BD9>BE9,1,0)+IF(BF9>BG9,1,0)+IF(BH9>BI9,1,0)+IF(BJ9>BK9,1,0)","v":2},{"$f":"IF(AQ9<AR9,1,0)+IF(AS9<AT9,1,0)+IF(AU9<AV9,1,0)+IF(AW9<AX9,1,0)+IF(AY9<AZ9,1,0)+IF(BB9<BC9,1,0)+IF(BD9<BE9,1,0)+IF(BF9<BG9,1,0)+IF(BH9<BI9,1,0)+IF(BJ9<BK9,1,0)","v":0},{"$f":"AJ9-AK9","v":2},{"$f":"AQ9+AS9+AU9+BB9+BD9+BF9","v":23},19,{"$f":"AM9-AN9","v":4},null,{"$f":"O7","v":12},{"$f":"Q7","v":10},{"$f":"S7","v":11},{"$f":"U7","v":9},{"$f":"W7","v":0},{"$f":"Y7","v":0}]
["Rangliste Gruppe A",null,null,null,{"$f":"AG17","v":"Sp."},"Pkte.","Bälle",null,null,null,null,null,null,null,null,null,null,null,null,null,null,null,null,null,null,null,null,null,null,null,null,null,null,{"$f":"SUM(AH8:AH9)","v":2},4,4,0,4,47,34,13]
[null,"1.",{"$f":"AF18","v":"FG RiWi 2"},null,{"$f":"AG18","v":2},{"$f":"AH18","v":4},{"$f":"AI18","v":47},":",{"$f":"AJ18","v":34},null,null,null,null,null,null,null,null,null,null,null,null,null,null,null,null,null,null,null,null,null,"A3",{"$f":"VLOOKUP(AE11,Gruppeneinteilung!$A$5:$B$20,2,0)","v":"SVD Diepoldsau"},1,{"$f":"IF(OR(AQ11>0,AR11>0),1,0)","v":1},{"$f":"((AQ11>AR11)*1+(AS11>AT11)*1+(AU11>AV11)*1+(AW11>AX11)*1+(AY11>AZ11)*1>1.99)*2+((BB11>BC11)*1+(BD11>BE11)*1+(BF11>BG11)*1+(BH11>BI11)*1+(BJ11>BK11)*1>1.99)*2","v":0},{"$f":"IF(AQ11>AR11,1,0)+IF(AS11>AT11,1,0)+IF(AU11>AV11,1,0)+IF(AW11>AX11,1,0)+IF(AY11>AZ11,1,0)+IF(BB11>BC11,1,0)+IF(BD11>BE11,1,0)+IF(BF11>BG11,1,0)+IF(BH11>BI11,1,0)+IF(BJ11>BK11,1,0)","v":1},{"$f":"IF(AQ11<AR11,1,0)+IF(AS11<AT11,1,0)+IF(AU11<AV11,1,0)+IF(AW11<AX11,1,0)+IF(AY11<AZ11,1,0)+IF(BB11<BC11,1,0)+IF(BD11<BE11,1,0)+IF(BF11<BG11,1,0)+IF(BH11<BI11,1,0)+IF(BJ11<BK11,1,0)","v":2},{"$f":"AJ11-AK11","v":-1},{"$f":"AQ11+AS11+AU11+BB11+BD11+BF11","v":34},35,{"$f":"AM11-AN11","v":-1},null,{"$f":"Q8","v":11},{"$f":"O8","v":9},{"$f":"U8","v":14},{"$f":"S8","v":15},{"$f":"Y8","v":9},{"$f":"W8","v":11}]
[null,"2.",{"$f":"AF19","v":"STV Affeltrangen"},null,{"$f":"AG19","v":2},{"$f":"AH19","v":2},{"$f":"AI19","v":50},":",{"$f":"AJ19","v":58},null,null,null,null,null,null,null,null,null,null,null,null,null,null,null,null,null,{"$f":"IF(BR8=0, \"DIREKTE BEGEGNUNG\", \"\")","v":""},null,null,null,null,null,2,{"$f":"IF(OR(AQ12>0,AR12>0),1,0)","v":1},{"$f":"((AQ12>AR12)*1+(AS12>AT12)*1+(AU12>AV12)*1+(AW12>AX12)*1+(AY12>AZ12)*1>1.99)*2+((BB12>BC12)*1+(BD12>BE12)*1+(BF12>BG12)*1+(BH12>BI12)*1+(BJ12>BK12)*1>1.99)*2","v":0},{"$f":"IF(AQ12>AR12,1,0)+IF(AS12>AT12,1,0)+IF(AU12>AV12,1,0)+IF(AW12>AX12,1,0)+IF(AY12>AZ12,1,0)+IF(BB12>BC12,1,0)+IF(BD12>BE12,1,0)+IF(BF12>BG12,1,0)+IF(BH12>BI12,1,0)+IF(BJ12>BK12,1,0)","v":0},{"$f":"IF(AQ12<AR12,1,0)+IF(AS12<AT12,1,0)+IF(AU12<AV12,1,0)+IF(AW12<AX12,1,0)+IF(AY12<AZ12,1,0)+IF(BB12<BC12,1,0)+IF(BD12<BE12,1,0)+IF(BF12<BG12,1,0)+IF(BH12<BI12,1,0)+IF(BJ12<BK12,1,0)","v":2},{"$f":"AJ12-AK12","v":-2},{"$f":"AQ12+AS12+AU12+BB12+BD12+BF12","v":19},{"$f":"AR12+AT12+AV12+BC12+BE12+BG12","v":23},{"$f":"AM12-AN12","v":-4},null,{"$f":"Q7","v":10},{"$f":"O7","v":12},{"$f":"U7","v":9},{"$f":"S7","v":11},{"$f":"Y7","v":0},{"$f":"W7","v":0}]
[null,"3.","SVD Diepoldsau",null,2,0,53,":",{"$f":"AJ20","v":58},null,null,null,null,null,null,null,null,null,null,null,null,null,null,null,null,null,null,null,null,null,null,null,null,{"$f":"SUM(AH11:AH12)","v":2},0,1,4,-3,53,58,-5]
[]
[null,null,null,null,null,null,null,null,null,null,null,null,null,null,null,null,null,null,null,null,null,null,null,null,null,null,null,null,null,null,"Kontrollsummen",null,null,{"$f":"+AH7+AH10+AH13","v":6},6,7,7,0,150,150,0,null,{"$f":"SUM(AQ5:AQ13)","v":57},57,73,73,20,20,0,0,0,0,null,{"$f":"SUM(BB5:BB13)","v":0},0,0,0,0,0,0,0,0,0]
["Resultate Gruppe B"]
[null,{"$f":"VLOOKUP(AB17,Gruppeneinteilung!$A$5:$B$20,2,0)","v":"TS Höchst"},null,"-",{"$f":"VLOOKUP(AC17,Gruppeneinteilung!$A$5:$B$20,2,0)","v":"FBV Ettenhausen "},null,null,null,null,0,":",2,null,"(",7,":",11,",",8,":",11,",",null,":",null,")",null,"B1","B2",null,null,null,"Sp.","Pkte.","Bälle",null,"+/-"]
[null,{"$f":"VLOOKUP(AB18,Gruppeneinteilung!$A$5:$B$20,2,0)","v":"FBV Ettenhausen "},null,"-",{"$f":"VLOOKUP(AC18,Gruppeneinteilung!$A$5:$B$20,2,0)","v":"FBT Flums"},null,null,null,null,2,":",0,null,"(",11,":",4,",",14,":",12,",",null,":",null,")",null,"B2","B3",null,"1.",{"$f":"$AF$8","v":"FG RiWi 2"},{"$f":"$AH$10","v":2},{"$f":"$AI$10","v":4},{"$f":"$AM$10","v":47},{"$f":"$AN$10","v":34},{"$f":"$AO$10","v":13}]
[null,{"$f":"VLOOKUP(AB19,Gruppeneinteilung!$A$5:$B$20,2,0)","v":"TS Höchst"},null,"-",{"$f":"VLOOKUP(AC19,Gruppeneinteilung!$A$5:$B$20,2,0)","v":"FBT Flums"},null,null,null,null,2,":",1,null,"(",11,":",9,",",8,":",11,",",8,":",11,")",null,"B1","B3",null,"2.",{"$f":"$AF$5","v":"STV Affeltrangen"},{"$f":"$AH$7","v":2},{"$f":"$AI$7","v":2},{"$f":"$AM$7","v":50},{"$f":"$AN$7","v":58},{"$f":"$AO$7","v":-8}]
[null,null,null,null,null,null,null,null,null,null,null,null,null,null,null,null,null,null,null,null,null,null,null,null,null,null,null,null,null,null,"3.",{"$f":"$AF$11","v":"SVD Diepoldsau"},{"$f":"$AH$13","v":2},{"$f":"$AI$13","v":0},{"$f":"$AM$13","v":53},{"$f":"$AN$13","v":58},{"$f":"$AO$13","v":-5}]
{"$rows_left_out":57}
{"sheet":"Schlussrangliste","index":5,"n_rows":51,"n_cols":63,"rows_kept":51,"cut":false,"hidden":false,"merged":[[37,30,41,30],[37,31,41,31],[45,34,45,35],[22,30,26,30],[22,31,26,31],[27,30,31,30],[27,31,31,31],[32,30,36,30],[32,31,36,31]]}
[{"$f":"CONCATENATE(MASTER!B1, \" \", MASTER!B8, \" - Kat. \", MASTER!B10)","v":"Ostschweizer Meisterschaft Halle 2019/2020 - Kat. U14"},null,null,null,null,null,null,null,null,null,null,null,null,null,null,null,null,null,null,null,null,null,null,null,null,null,null,null,null,{"$f":"TODAY()","v":"2019-12-15"}]
[{"$f":"CONCATENATE(MASTER!B3,\" / \",MASTER!C3)","v":"So. 15.12.2019 / Aadorf, Löhracker"}]
[]
[]
[]
[null,"Schlussrangliste"]
[]
[]
[null,"1.",{"$f":"CONCATENATE('Resultate VR'!AB74,\" (OSTSCHWEIZERMEISTER)\")","v":"FBV Ettenhausen  (OSTSCHWEIZERMEISTER)"}]
[null,"2.",{"$f":"'Resultate VR'!AC74","v":"FG RiWi 2"}]
[null,"3.",{"$f":"'Resultate VR'!AB72","v":"SVD Diepoldsau"}]
[null,"4.",{"$f":"'Resultate VR'!AC72","v":"STV Affeltrangen"}]
[null,"5.",{"$f":"'Resultate VR'!AB70","v":"TS Höchst"}]
[null,"6.",{"$f":"'Resultate VR'!AC70","v":"FBT Flums"}]
[null,"7.",{"$f":"'Resultate VR'!C40","v":"FG RiWi 1"}]
[null,"8.",{"$f":"'Resultate VR'!C41","v":"STV Wigoltingen"}]
[null,"9.",{"$f":"'Resultate VR'!C42","v":"JFB Widnau"}]
[null,"10.",{"$f":"'Resultate VR'!C43","v":"TS Schwarzach"}]
[null,"11.",{"$f":"'Resultate VR'!C44","v":"Satus Kreuzlingen"}]
[]
{"$rows_left_out":32}
{"sheet":"Spielberichte","index":6,"n_rows":36,"n_cols":48,"rows_kept":36,"cut":false,"hidden":false,"merged":[[4,4,4,14],[4,21,4,32],[1,0,1,26],[2,0,2,26],[2,27,2,28],[2,29,2,30],[2,31,2,32],[13,0,14,5],[13,15,14,20],[13,21,13,22],[14,21,14,22],[6,0,6,14],[6,15,6,32],[7,0,7,14],[7,15,7,29],[9,0,9,14],[10,0,10,14],[12,23,12,24],[12,25,12,26],[12,27,12,28],[12,29,12,30],[12,31,12,32],[16,0,17,1],[18,0,19,1],[20,0,21,1],[22,0,23,1],[24,0,25,1],[28,4,28,27],[28,28,29,32],[29,0,29,3],[29,4,29,7],[29,8,29,11],[29,12,29,15],[29,16,29,19],[29,20,29,23],[29,24,29,27],[28,0,28,3],[30,24,30,27],[30,28,30,32],[30,0,30,3],[30,4,30,7],[30,8,30,11],[30,12,30,15],[30,16,30,19],[30,20,30,23]]}
[null,null,null,null,null,null,"FAUSTBALL-SPIELBERICHT"]
[{"$f":"CONCATENATE(MASTER!B1,\" \",MASTER!B8)","v":"Ostschweizer Meisterschaft Halle 2019/2020"},null,null,null,null,null,null,null,null,null,null,null,null,null,null,null,null,null,null,null,null,null,null,null,null,null,null,"Gr.",null,"Feld Nr.",null,"Spiel  Nr.",null,null,null,"Spiel Nr.",13,null,"Spiel","Gruppe","Feld","Spiel","Team A","Team B","Schiri","Team A","Team B","Schiri"]
[{"$f":"CONCATENATE(\"Kat. \",MASTER!B10,\" / FINALRUNDE\")","v":"Kat. U14 / FINALRUNDE"},null,null,null,null,null,null,null,null,null,null,null,null,null,null,null,null,null,null,null,null,null,null,null,null,null,null,{"$f":"VLOOKUP(AK2,AM3:AV30,2,1)","v":"1/2"},null,{"$f":"VLOOKUP(AK2,AM3:AV30,3,1)","v":1},null,{"$f":"VLOOKUP(AK2,AM3:AV30,4,1)","v":13},null,null,null,null,null,null,1,"A",1,1,{"$f":"VLOOKUP(AT3,Gruppeneinteilung!$A$5:$B$20,2,0)","v":"STV Affeltrangen"},{"$f":"VLOOKUP(AU3,Gruppeneinteilung!$A$5:$B$20,2,0)","v":"FG RiWi 2"},{"$f":"VLOOKUP(AV3,Gruppeneinteilung!$A$5:$B$20,2,0)","v":"SVD Diepoldsau"},"A1","A2","A3"]
[null,null,null,null,null,null,null,null,null,null,null,null,null,null,null,null,null,null,null,null,null,null,null,null,null,null,null,null,null,null,null,null,null,null,null,null,null,null,2,"B",2,2,{"$f":"VLOOKUP(AT4,Gruppeneinteilung!$A$5:$B$20,2,0)","v":"TS Höchst"},{"$f":"VLOOKUP(AU4,Gruppeneinteilung!$A$5:$B$20,2,0)","v":"FBV Ettenhausen "},{"$f":"VLOOKUP(AV4,Gruppeneinteilung!$A$5:$B$20,2,0)","v":"FBT Flums"},"B1","B2","B3"]
["  Datum/Zeit:",null,null,null,{"$f":"MASTER!B3","v":"So. 15.12.2019"},null,null,null,null,null,null,null,null,null,null,"  Sportplatz/Halle:",null,null,null,null,null,{"$f":"MASTER!C3","v":"Aadorf, Löhracker"},null,null,null,null,null,null,null,null,null,null,null,null,null,null,null,null,3,"A",1,3,{"$f":"VLOOKUP(AT5,Gruppeneinteilung!$A$5:$B$20,2,0)","v":"FG RiWi 2"},{"$f":"VLOOKUP(AU5,Gruppeneinteilung!$A$5:$B$20,2,0)","v":"SVD Diepoldsau"},{"$f":"VLOOKUP(AV5,Gruppeneinteilung!$A$5:$B$20,2,0)","v":"STV Affeltrangen"},"A2","A3","A1"]
[null,null,null,null,null,null,null,null,null,null,null,null,null,null,null,null,null,null,null,null,null,null,null,null,null,null,null,null,null,null,null,null,null,null,null,null,null,null,4,"B",2,4,{"$f":"VLOOKUP(AT6,Gruppeneinteilung!$A$5:$B$20,2,0)","v":"FBV Ettenhausen "},{"$f":"VLOOKUP(AU6,Gruppeneinteilung!$A$5:$B$20,2,0)","v":"FBT Flums"},{"$f":"VLOOKUP(AV6,Gruppeneinteilung!$A$5:$B$20,2,0)","v":"TS Höchst"},"B2","B3","B1"]
["Mannschaft A:",null,null,null,null,null,null,null,null,null,null,null,null,null,null,"Mannschaft B:",null,null,null,null,null,null,null,null,null,null,null,null,null,null,null,null,null,null,null,null,null,null,5,"A",1,5,{"$f":"VLOOKUP(AT7,Gruppeneinteilung!$A$5:$B$20,2,0)","v":"STV Affeltrangen"},{"$f":"VLOOKUP(AU7,Gruppeneinteilung!$A$5:$B$20,2,0)","v":"SVD Diepoldsau"},{"$f":"VLOOKUP(AV7,Gruppeneinteilung!$A$5:$B$20,2,0)","v":"FG RiWi 2"},"A1","A3","A2"]
[{"$f":"VLOOKUP(AK2,AM3:AV30,5,1)","v":"FG RiWi 2"},null,null,null,null,null,null,null,null,null,null,null,null,null,null,{"$f":"VLOOKUP(AK2,AM3:AV30,6,1)","v":"FBV Ettenhausen "},null,null,null,null,null,null,null,null,null,null,null,null,null,null,null,null,null,null,null,null,null,null,6,"B",2,6,{"$f":"VLOOKUP(AT8,Gruppeneinteilung!$A$5:$B$20,2,0)","v":"TS Höchst"},{"$f":"VLOOKUP(AU8,Gruppeneinteilung!$A$5:$B$20,2,0)","v":"FBT Flums"},{"$f":"VLOOKUP(AV8,Gruppeneinteilung!$A$5:$B$20,2,0)","v":"FBV Ettenhausen "},"B1","B3","B2"]
[null,null,null,null,null,null,null,null,null,null,null,null,null,null,null,null,null,null,null,null,null,null,null,null,null,null,null,null,null,null,null,null,null,null,null,null,null,null,7,"VF1",1,7,{"$f":"'Resultate VR'!B54","v":"STV Affeltrangen"},{"$f":"'Resultate VR'!E54","v":"TS Höchst"},{"$f":"'Resultate VR'!C11","v":"FG RiWi 2"}]
["  Schiedsrichter:",null,null,null,null,null,null,null,null,null,null,null,null,null,null,"  Anschreiber:",null,null,null,null,null,null,null,null,null,null,null,null,null,null,null,null,null,null,null,null,null,null,8,"VF2",2,8,{"$f":"'Resultate VR'!B56","v":"FBT Flums"},{"$f":"'Resultate VR'!E56","v":"SVD Diepoldsau"},{"$f":"'Resultate VR'!C22","v":"FBV Ettenhausen "}]
[{"$f":"VLOOKUP(AK2,AM3:AV30,7,1)","v":"SVD Diepoldsau"},null,null,null,null,null,null,null,null,null,null,null,null,null,null,"  Linienrichter:",null,null,null,null,null,null,null,null,null,null,null,null,null,null,null,null,null,null,null,null,null,null,9,"HF1",1,9,{"$f":"'Resultate VR'!B62","v":"FG RiWi 2"},{"$f":"'Resultate VR'!E62","v":"SVD Diepoldsau"},{"$f":"'Resultate VR'!AC54","v":"TS Höchst"}]
[null,null,null,null,null,null,null,null,null,null,null,null,null,null,null,null,null,null,null,null,null,null,null,null,null,null,null,null,null,null,null,null,null,null,null,null,null,null,10,"HF2",2,10,{"$f":"'Resultate VR'!B64","v":"FBV Ettenhausen "},{"$f":"'Resultate VR'!E64","v":"STV Affeltrangen"},{"$f":"'Resultate VR'!AC56","v":"FBT Flums"}]
[null,null,null,null,null,null,null,"1.Satz/Halbzeit",null,null,null,null,"5.Satz",null,null,null,null,null,null,null,null,null,null,"1. Satz",null,"2. Satz",null,"3. Satz",null,"4. Satz",null,"5. Satz",null,null,null,null,null,null,11,"5/6",1,11,{"$f":"'Resultate VR'!B70","v":"TS Höchst"},{"$f":"'Resultate VR'!E70","v":"FBT Flums"},{"$f":"'Resultate VR'!AB62","v":"FG RiWi 2"}]
["  Ballwahl/Anspiel:",null,null,null,null,null,"A",null,null,null,null,null,null,null,null,"Timeout:",null,null,null,null,null,"A",null,null,null,null,null,null,null,null,null,null,null,null,null,null,null,null,12,"3/4",2,12,{"$f":"'Resultate VR'!B72","v":"SVD Diepoldsau"},{"$f":"'Resultate VR'!E72","v":"STV Affeltrangen"},{"$f":"'Resultate VR'!AB64","v":"FBV Ettenhausen "}]
[null,null,null,null,null,null,"B",null,null,null,null,null,null,null,null,null,null,null,null,null,null,"B",null,null,null,null,null,null,null,null,null,null,null,null,null,null,null,null,13,"1/2",1,13,{"$f":"'Resultate VR'!B74","v":"FG RiWi 2"},{"$f":"'Resultate VR'!E74","v":"FBV Ettenhausen "},{"$f":"'Resultate VR'!AB72","v":"SVD Diepoldsau"}]
[null,null,null,null,null,null,null,null,null,null,null,null,null,null,null,null,null,null,null,null,null,null,null,null,null,null,null,null,null,null,null,null,null,null,null,null,null,null,14,"C",3,14,{"$f":"VLOOKUP(AT16,Gruppeneinteilung!$A$5:$B$20,2,0)","v":"FG RiWi 1"},{"$f":"VLOOKUP(AU16,Gruppeneinteilung!$A$5:$B$20,2,0)","v":"TS Schwarzach"},{"$f":"VLOOKUP(AV16,Gruppeneinteilung!$A$5:$B$20,2,0)","v":"JFB Widnau"},"C1","C2","C5"]
["1. Satz",null,"A",null,null,null,null,null,null,null,null,null,null,null,null,null,null,null,null,null,null,null,null,null,null,null,null,null,null,null,null,null,"A",null,null,null,null,null,15,"C",3,15,{"$f":"VLOOKUP(AT17,Gruppeneinteilung!$A$5:$B$20,2,0)","v":"STV Wigoltingen"},{"$f":"VLOOKUP(AU17,Gruppeneinteilung!$A$5:$B$20,2,0)","v":"Satus Kreuzlingen"},{"$f":"VLOOKUP(AV17,Gruppeneinteilung!$A$5:$B$20,2,0)","v":"FG RiWi 1"},"C3","C4","C1"]
[null,null,"B",null,null,null,null,null,null,null,null,null,null,null,null,null,null,null,null,null,null,null,null,null,null,null,null,null,null,null,null,null,"B",null,null,null,null,null,16,"C",3,16,{"$f":"VLOOKUP(AT18,Gruppeneinteilung!$A$5:$B$20,2,0)","v":"FG RiWi 1"},{"$f":"VLOOKUP(AU18,Gruppeneinteilung!$A$5:$B$20,2,0)","v":"JFB Widnau"},{"$f":"VLOOKUP(AV18,Gruppeneinteilung!$A$5:$B$20,2,0)","v":"Satus Kreuzlingen"},"C1","C5","C4"]
["2. Satz",null,"A",null,null,null,null,null,null,null,null,null,null,null,null,null,null,null,null,null,null,null,null,null,null,null,null,null,null,null,null,null,"A",null,null,null,null,null,17,"C",3,17,{"$f":"VLOOKUP(AT19,Gruppeneinteilung!$A$5:$B$20,2,0)","v":"TS Schwarzach"},{"$f":"VLOOKUP(AU19,Gruppeneinteilung!$A$5:$B$20,2,0)","v":"STV Wigoltingen"},{"$f":"VLOOKUP(AV19,Gruppeneinteilung!$A$5:$B$20,2,0)","v":"FG RiWi 1"},"C2","C3","C1"]
[null,null,"B",null,null,null,null,null,null,null,null,null,null,null,null,null,null,null,null,null,null,null,null,null,null,null,null,null,null,null,null,null,"B",null,null,null,null,null,18,"C",3,18,{"$f":"VLOOKUP(AT20,Gruppeneinteilung!$A$5:$B$20,2,0)","v":"Satus Kreuzlingen"},{"$f":"VLOOKUP(AU20,Gruppeneinteilung!$A$5:$B$20,2,0)","v":"JFB Widnau"},{"$f":"VLOOKUP(AV20,Gruppeneinteilung!$A$5:$B$20,2,0)","v":"TS Schwarzach"},"C4","C5","C2"]
{"$rows_left_out":16}